Sign Up

Sign In

Forget Password

Lost your password? Please enter your email address. You will receive a link and will create a new password via email.

You must login to ask question.

Discy Latest Questions

  • 0

I have a unity project I am exporting that project as android studio project while opening the android studio project I am getting this error Gradle sync failed: Could not find manifest-merger.jar (com.android.tools.build:manifest-merger:26.0.1). Searched in ...

  • 0

I’m getting the following error when trying to compile my app: FAILURE: Build failed with an exception.* What went wrong: A problem occurred configuring project ':myProject'. > Could not resolve all files for configuration ':myProject:classpath'. > Could not find org.jetbrains.trove4j:trove4j:20160824. ...

  • 0

Since this night, maven site 3.3 plugins stop to work. Try to delete local repository, but no change. Maven 3.3.9 java 1.8 No config or dependencies defined in pom for site plugins [WARNING] Error injecting: org.apache.maven.report.projectinfo.CiManagementReport java.lang.NoClassDefFoundError: org/apache/maven/doxia/siterenderer/DocumentContent

  • 0

In eclipse when i started my application i got this – Could not discover the dialect to use. java.sql.SQLException: Unable to load authentication plugin ‘caching_sha2_password’. at java.sql.SQLException: Unable to load authentication plugin ‘caching_sha2_password’. at at com.mysql.jdbc.SQLError.createSQLException(SQLError.java:868) at at com.mysql.jdbc.SQLError.createSQLException(SQLError.java:864) at at ...

close