Sign Up

Sign In

Forget Password

Lost your password? Please enter your email address. You will receive a link and will create a new password via email.

You must login to ask question.

Discy Latest Questions

  • 0

The Problem is that i am able to run my app when i change to debug mode but it fails when i switch to release mode. Exception: FAILURE: Build failed with an exception. Execution failed for task ‘:app:transformClassesWithDexForRelease’. com.android.build.api.transform.TransformException: com.android.ide.common.process.ProcessException: java.util.concurrent.ExecutionException: com.android.ide.common.process.ProcessException: org.gradle.process.internal.ExecException: Process ‘command ‘/Library/Java/JavaVirtualMachines/jdk1.8.0_65.jdk/Contents/Home/bin/java” finished ...

close