Sign Up

Sign In

Forget Password

Lost your password? Please enter your email address. You will receive a link and will create a new password via email.

You must login to ask question.

Discy Latest Questions

  • 0

I build the project at gitlab ci ./gradlew assembleDebug --stacktrace and sometimes it throws an error: FAILURE: Build failed with an exception. * What went wrong: Execution failed for task ':app:transformClassesWithDexBuilderForDebug'. > com.android.build.api.transform.TransformException: java.lang.IllegalStateException: Dex archives: setting .DEX extension only for .CLASS files At my local pc ...

close