Sign Up

Sign In

Forget Password

Lost your password? Please enter your email address. You will receive a link and will create a new password via email.

You must login to ask question.

Discy Latest Questions

  • 0

I build the project at gitlab ci ./gradlew assembleDebug --stacktrace and sometimes it throws an error: FAILURE: Build failed with an exception. * What went wrong: Execution failed for task ':app:transformClassesWithDexBuilderForDebug'. > com.android.build.api.transform.TransformException: java.lang.IllegalStateException: Dex archives: setting .DEX extension only for .CLASS files At my local pc ...

  • 0

I have this error I am try reinstall android studio and remove .gradle folder , any solution please? Error:FAILURE: Build failed with an exception.* What went wrong: Execution failed for task ':app:processDebugResources'. > Android resource linking failed (AAPT2 27.0.3 Daemon ...

  • 0

/Users/Ren/Desktop/RecylerViewBaseAdapter/build.gradle Error:(6, 0) Gradle DSL method not found: 'google()' Possible causes: The project 'RecylerViewBaseAdapter' may be using a version of Gradle that does not contain the method. Gradle settings The build file may be missing a Gradle plugin. Apply Gradle plugin

  • 0

Error:Execution failed for task ':app:compileDebugKotlin'. > Compilation error. See log for more detailsSolution Tried:Invalidate Caches/Restart Build -> Clean Project Update kotlin plugin, used lastest version of kotlin, google apis.EDIT./gradlew build --stacktrace > logs.txt 2>logErrors.txtlogErrors.txt* Exception is: org.gradle.api.tasks.TaskExecutionException: Execution failed for task ':app:compileDebugKotlin'. ...

  • 0

I update the gradle plugin to the latest : com.android.tools.build:gradle:3.0.0-alpha1 and this error occured : export TERM="dumb" if [ -e ./gradlew ]; then ./gradlew test;else gradle test;fiFAILURE: Build failed with an exception.What went wrong: A problem occurred configuring root project 'Android-app'. ...

  • 0

I have replaced every occurrence of compile by implementation in my project’s build.gradle, but I’m still getting this warning : Configuration ‘compile’ is obsolete and has been replaced with ‘implementation’ I tried to look for “compile ” in the whole project but no match was found. ...

  • 0

I got an error of node_modules/rxjs/internal/types.d.ts(81,44): error TS1005: ‘;’ expected. after the installation of Angular 6. Check the error: ERROR in node_modules/rxjs/internal/types.d.ts(81,44): error TS1005: ';' expected. node_modules/rxjs/internal/types.d.ts(81,74): error TS1005: ';' expected. node_modules/rxjs/internal/types.d.ts(81,77): error TS1109: Expression expected

close