Sign Up

Sign In

Forget Password

Lost your password? Please enter your email address. You will receive a link and will create a new password via email.

You must login to ask question.

Discy Latest Questions

  • 0

I have a bunch of third party libs that I include in my base application. I cannot control the support library those 3rd party modules include. This makes it hard to have the same version of the android support library ...

  • 0

I have recently updated my Android Studio to 3.1.2 . After the update I tried opening the existing project and was shown multiple gradle errors while compiling the project. Those errors pointed me to update the ‘compile’ statement to ‘implementation’, which I did, still ...

  • 0

Is it advantageously to have multiple modules in an Android Studio Project over having only a single large app-module? I know about Android Modules in general and the advantages of SOLID so my focus is especially considering build performance. As gradle can do incremental builds, ...

  • 0

When I updated my Android Studio to 3.0 in the stable channel and ran the project, I started getting the below error. Error:Execution failed for task ':app:transformDexArchiveWithExternalLibsDexMergerForDebug'. com.android.builder.dexing.DexArchiveMergerException: Unable to merge dex I tried cleaning and rebuilding the project, but it didn’t work. ...

  • 0

Error Details AGPBI: {"kind":"error","text":"error: u003citemu003e inner element must either be a resource reference or empty.","sources":[{"file":"...\app\src\main\res\values\ids.xml","position":{"startLine":2,"startColumn":4,"startOffset":57,"endColumn":61,"endOffset":114}}],"original":"","tool":"AAPT"} :app:mergeDebugResources Error: java.util.concurrent.ExecutionException: com.android.builder.internal.aapt.v2.Aapt2Exception: AAPT2 error: check logs for details :app:mergeDebugResources FAILEDFAILURE: Build failed with an exception.* What went wrong: Execution failed for task ':app:mergeDebugResources'. > Error: java.util.concurrent.ExecutionException: com.android.builder.internal.aapt.v2.Aapt2Exception: AAPT2 error: ...

  • 0

I have a problem on my Android project, I can’t build, this is the error I have: Failed to notify dependency resolution listener. The library com.google.android.gms:play-services-measurement-base is being requested by various other libraries at [[15.0.2,15.0.2], [15.0.4,15.0.4]], but resolves to 15.0.4. Disable ...

  • 0

Using the latest Android Studio 3.0 Canary 5 Here’s the error: Error:(1, 1) A problem occurred evaluating project ‘:app’. Failed to apply plugin [class ‘com.android.build.gradle.api.AndroidBasePlugin’] Android Gradle plugin 3.0.0-alpha5 must not be applied to project [path_to_my_project] since version 3.0.0-alpha5 was already applied to ...

  • 0

Newly installed Android studio 3.1.3 is giving strange dependencies error when making a new project and compiling for very first time. A similar question that didn’t help resolve the problem. Event Logs: Unable to resolve dependency for ':[email protected]/compileClasspath': Could not resolve com.android.support:appcompat-v7:28.0.0-alpha3. Open File Show DetailsUnable to resolve ...

  • 0

I got this error after updating library com.google.firebase:firebase-core:16.0.6 to version 16.0.7. Could not get resource 'https://dl.google.com/dl/android/maven2/com/google/firebase/firebase-measurement-connector-impl/17.0.5/firebase-measurement-connector-impl-17.0.5-javadoc.jar'. It compiles anyway. Anybody knows how to solve this?

close