Sign Up

Sign In

Forget Password

Lost your password? Please enter your email address. You will receive a link and will create a new password via email.

You must login to ask question.

Share & grow the world's knowledge!

We want to connect the people who have knowledge to the people who need it, to bring together people with different perspectives so they can understand each other better, and to empower everyone to share their knowledge.

What's your question?

Discy Latest Questions

  • 1

Error:Execution failed for task ':app:compileDebugKotlin'. > Compilation error. See log for more detailsSolution Tried:Invalidate Caches/Restart Build -> Clean Project Update kotlin plugin, used lastest version of kotlin, google apis.EDIT./gradlew build --stacktrace > logs.txt 2>logErrors.txtlogErrors.txt* Exception is: org.gradle.api.tasks.TaskExecutionException: Execution failed for task ':app:compileDebugKotlin'. ...

  • 0

After upgrading my project to Android O buildToolsVersion "26.0.1" Lint in Android Studio is showing a deprecated warning for the follow notification builder method: new NotificationCompat.Builder(context) The problem is: Android Developers update their Documentation describing NotificationChannel to support notifications in Android O, and provide us with a snippet, ...

  • 0

Got this freaky error Installation failed with message Failed to finalize session : INSTALL_FAILED_USER_RESTRICTED: Install canceled by user. It is possible that this issue is resolved by uninstalling an existing version of the apk if it is present, and then re-installing.WARNING: Uninstalling ...

  • 0

When compiling my project I get the following error message: Program type already present: com.google.android.gms.internal.measurement.zzabn Message{kind=ERROR, text=Program type already present: com.google.android.gms.internal.measurement.zzabn, sources=[Unknown source file], tool name=Optional.of(D8)} or D8: Program type already present: com.google.android.gms.internal.measurement.zzabo With the following stacktrace in the Gradle Log at com.android.builder.profile.Recorder$Block.handleException(Recorder.java:55) ...

  • 0

Since I upgraded the project with the latest version of google services and libraries (9.0.0), I have this strange issue : Grade console : :app:processDebugGoogleServices Parsing json file: /Users/cyrilmorales/Documents/Projects/mobilemeans-punainenristi/app/google-services.json :app:processDebugGoogleServices FAILED Error:Execution failed for task ':app:processDebugGoogleServices'. > Missing api_key/current_key object Information:BUILD FAILED build.gradle (root) : dependencies { ...

  • 0

I update the gradle plugin to the latest : com.android.tools.build:gradle:3.0.0-alpha1 and this error occured : export TERM="dumb" if [ -e ./gradlew ]; then ./gradlew test;else gradle test;fiFAILURE: Build failed with an exception.What went wrong: A problem occurred configuring root project 'Android-app'. ...

  • 0

Trying to create a react-native project on Android 4.4.2 I get this error screen error “Could not get BatchedBridge, make sure your bundle is packaged properly” on start of app and couldn’t find any way to resolve it. I tried restarting packager, ...

  • 0

Lately we have suddenly been seeing a few of the following stack traces. Why could that be? This is from when the app tries to move an audio commentary service into the foreground with a media notification and everything. java.lang.SecurityException: Permission ...

close